Target
Ectonucleotide pyrophosphatase/phosphodiesterase family member 2
Ligand
BDBM389140
Substrate
Meas. Tech.
Inhibition Assay
IC50
>10000±n/a nM
Citation
 Hutchinson, JHParr, TABunker, KDLonergan, D Heterocyclic vinyl autotaxin inhibitor compounds US Patent  US9951026 Publication Date 4/24/2018 
Target
Name:
Ectonucleotide pyrophosphatase/phosphodiesterase family member 2
Synonyms:
ATX Autotaxin (ATX) ENPP2 Ectonucleotide Pyrophosphatase/Phosphodiesterase 2 (ENPP2) Extracellular lysophospholipase D PDNP2
Type:
Enzyme
Mol. Mass.:
99007.13
Organism:
Homo sapiens (Human)
Description:
Q13822
Residue:
863
  
Inhibitor
Name:
BDBM389140
Synonyms:
US9951026, 1-5
Type:
Small organic molecule
Emp. Form.:
C22H16ClN5O2
Mol. Mass.:
417.848
SMILES:
Cn1ccc(Cn2nc(\C=C(/C#N)c3ccc(cc3)C(O)=O)c3ccc(Cl)cc23)n1
: