Target
Ectonucleotide pyrophosphatase/phosphodiesterase family member 2
Ligand
BDBM389141
Substrate
Meas. Tech.
Inhibition Assay
IC50
<500±n/a nM
Citation
 Hutchinson, JHParr, TABunker, KDLonergan, D Heterocyclic vinyl autotaxin inhibitor compounds US Patent  US9951026 Publication Date 4/24/2018 
Target
Name:
Ectonucleotide pyrophosphatase/phosphodiesterase family member 2
Synonyms:
ATX Autotaxin (ATX) ENPP2 Ectonucleotide Pyrophosphatase/Phosphodiesterase 2 (ENPP2) Extracellular lysophospholipase D PDNP2
Type:
Enzyme
Mol. Mass.:
99007.13
Organism:
Homo sapiens (Human)
Description:
Q13822
Residue:
863
  
Inhibitor
Name:
BDBM389141
Synonyms:
US9951026, 1-6
Type:
Small organic molecule
Emp. Form.:
C23H14Cl2N4O2
Mol. Mass.:
449.289
SMILES:
OC(=O)c1ccc(cc1)C(=C\c1nn(Cc2ccc(Cl)nc2)c2cc(Cl)ccc12)\C#N
: