Target
Ectonucleotide pyrophosphatase/phosphodiesterase family member 2
Ligand
BDBM389142
Substrate
Meas. Tech.
Inhibition Assay
IC50
<500±n/a nM
Citation
 Hutchinson, JHParr, TABunker, KDLonergan, D Heterocyclic vinyl autotaxin inhibitor compounds US Patent  US9951026 Publication Date 4/24/2018 
Target
Name:
Ectonucleotide pyrophosphatase/phosphodiesterase family member 2
Synonyms:
ATX Autotaxin (ATX) ENPP2 Ectonucleotide Pyrophosphatase/Phosphodiesterase 2 (ENPP2) Extracellular lysophospholipase D PDNP2
Type:
Enzyme
Mol. Mass.:
99007.13
Organism:
Homo sapiens (Human)
Description:
Q13822
Residue:
863
  
Inhibitor
Name:
BDBM389142
Synonyms:
US9951026, 1-7
Type:
Small organic molecule
Emp. Form.:
C24H17ClN4O3
Mol. Mass.:
444.87
SMILES:
COc1ccc(Cn2nc(\C=C(/C#N)c3ccc(cc3)C(O)=O)c3ccc(Cl)cc23)cn1
: