Target
Ectonucleotide pyrophosphatase/phosphodiesterase family member 2
Ligand
BDBM389143
Substrate
Meas. Tech.
Inhibition Assay
IC50
50250±n/a nM
Citation
 Hutchinson, JHParr, TABunker, KDLonergan, D Heterocyclic vinyl autotaxin inhibitor compounds US Patent  US9951026 Publication Date 4/24/2018 
Target
Name:
Ectonucleotide pyrophosphatase/phosphodiesterase family member 2
Synonyms:
ATX Autotaxin (ATX) ENPP2 Ectonucleotide Pyrophosphatase/Phosphodiesterase 2 (ENPP2) Extracellular lysophospholipase D PDNP2
Type:
Enzyme
Mol. Mass.:
99007.13
Organism:
Homo sapiens (Human)
Description:
Q13822
Residue:
863
  
Inhibitor
Name:
BDBM389143
Synonyms:
US9951026, 1-8
Type:
Small organic molecule
Emp. Form.:
C23H16ClFN2O2
Mol. Mass.:
406.837
SMILES:
OC(=O)c1ccc(\C=C\c2nn(Cc3ccc(F)cc3)c3cc(Cl)ccc23)cc1
: