Target
Ectonucleotide pyrophosphatase/phosphodiesterase family member 2
Ligand
BDBM389159
Substrate
Meas. Tech.
Inhibition Assay
IC50
50250±n/a nM
Citation
 Hutchinson, JHParr, TABunker, KDLonergan, D Heterocyclic vinyl autotaxin inhibitor compounds US Patent  US9951026 Publication Date 4/24/2018 
Target
Name:
Ectonucleotide pyrophosphatase/phosphodiesterase family member 2
Synonyms:
ATX Autotaxin (ATX) ENPP2 Ectonucleotide Pyrophosphatase/Phosphodiesterase 2 (ENPP2) Extracellular lysophospholipase D PDNP2
Type:
Enzyme
Mol. Mass.:
99007.13
Organism:
Homo sapiens (Human)
Description:
Q13822
Residue:
863
  
Inhibitor
Name:
BDBM389159
Synonyms:
US9951026, 3-2
Type:
Small organic molecule
Emp. Form.:
C24H18N4O3
Mol. Mass.:
410.4247
SMILES:
COc1ccc(Cn2cc(\C=C(/C#N)c3ccc(cc3)C(O)=O)c3cccnc23)cn1
: