Target
Plasma kallikrein
Ligand
BDBM241409
Substrate
Meas. Tech.
Inhibition Assay
Ki
2.00±n/a nM
Citation
 Yang, WCorte, JRGilligan, PJPinto, DJEwing, WRDilger, AKWang, YFang, TPabbisetty, KBSmith, II, LM Dihydropyridone P1 as factor XIa inhibitors US Patent  US9951071 Publication Date 4/24/2018 
Target
Name:
Plasma kallikrein
Synonyms:
Fletcher factor KLKB1 Kallikrein Plasma kallikrein heavy chain Plasma prekallikrein
Type:
Protein
Mol. Mass.:
71391.16
Organism:
Homo sapiens (Human)
Description:
P03952
Residue:
638
  
Inhibitor
Name:
BDBM241409
Synonyms:
US9409908, 41 | US9951071, Example 41
Type:
Small organic molecule
Emp. Form.:
C33H31ClF2N6O4
Mol. Mass.:
649.087
SMILES:
COCc1nnc(Nc2ccc-3c(NC(=O)[C@H](C)CCC[C@H](N4CCC(=CC4=O)c4c(F)ccc(Cl)c4F)c4cc-3ccn4)c2)o1
: