Target
Histone deacetylase 1
Ligand
BDBM239064
Substrate
Meas. Tech.
Inhibition Assay
IC50
7560±n/a nM
Citation
 Sotomayor, EMBergman, JKozikowski, AWoan, KVVillagra, AV Selective histone deactylase 6 inhibitors US Patent  US9956192 Publication Date 5/1/2018 
Target
Name:
Histone deacetylase 1
Synonyms:
Cereblon/Histone deacetylase 1 HDAC1 Histone deacetylase 1 (HDAC1) RPD3L1
Type:
Enzyme
Mol. Mass.:
55090.27
Organism:
Homo sapiens (Human)
Description:
Q13547
Residue:
482
  
Inhibitor
Name:
BDBM239064
Synonyms:
US10227295, Compound 11a US9956192, Compound 11a
Type:
Small organic molecule
Emp. Form.:
C18H17N3O4
Mol. Mass.:
339.3453
SMILES:
ONC(=O)c1ccc(CN2C(=O)N[C@@H](Cc3ccccc3)C2=O)cc1
: