Target
Tyrosine-protein kinase JAK2
Ligand
BDBM390984
Substrate
Meas. Tech.
Biochemical HTRF Assay
IC50
0.120±n/a nM
Citation
 Childers, MLFuller, PGuerin, DKatz, JDPu, QScott, METhompson, CFMartinez, MFalcone, DTorres, LDeng, YKurukulasuriya, RZeng, HBai, YKong, NLiu, YZheng, Z Geminally substituted cyanoethylpyrazolo pyridones as Janus kinase inhibitors US Patent  US9957264 Publication Date 5/1/2018 
Target
Name:
Tyrosine-protein kinase JAK2
Synonyms:
JAK-2 JAK2_HUMAN Janus kinase 2 (JAK2) | Janus kinase 2 (a protein tyrosine kinase)
Type:
Protein
Mol. Mass.:
130684.68
Organism:
Homo sapiens (Human)
Description:
O60674
Residue:
1132
  
Inhibitor
Name:
BDBM390984
Synonyms:
(2S,5S)-tert-butyl 5- (cyanomethyl)-5-(3-((2- methyl-1,1-dioxido-2,3- dihydrobenzo[d]isothiazol- 5-yl)amino)-4-oxo-4,5- dihydro-1H-pyrazolo[4,3- c]pyridin-1-yl)tetrahydro- 2H-pyran-2-carboxylate (from I-14-1A) | US9957264, Example 5-55
Type:
Small organic molecule
Emp. Form.:
C26H30N6O6S
Mol. Mass.:
554.618
SMILES:
CN1Cc2cc(Nc3nn(c4cc[nH]c(=O)c34)[C@]3(CC#N)CC[C@H](OC3)C(=O)OC(C)(C)C)ccc2S1(=O)=O
: