Target
E3 ubiquitin-protein ligase XIAP [241-356]
Ligand
BDBM27942
Substrate
BDBM17342
Meas. Tech.
Fluorescence Polarization Affinity Measurements
Ki
345±n/a nM
Citation
 Cohen, FAlicke, BElliott, LOFlygare, JAGoncharov, TKeteltas, SFFranklin, MCFrankovitz, SStephan, JPTsui, VVucic, DWong, HFairbrother, WJ Orally bioavailable antagonists of inhibitor of apoptosis proteins based on an azabicyclooctane scaffold. J Med Chem 52:1723-30 (2009)  
Target
Name:
E3 ubiquitin-protein ligase XIAP [241-356]
Synonyms:
API3 BIRC4 E3 ubiquitin-protein ligase XIAP BIR-3 IAP3 X-linked inhibitor of apoptosis protein BIR3 domain (XIAP BIR-3) XIAP-BIR3 baculovirus IAP repeat 3 (BIR3) domain of XIAP
Type:
Protein Binding Domain
Mol. Mass.:
13276.62
Organism:
Homo sapiens (Human)
Description:
BIR3 of XIAP: RESIDUES 241-356.
Residue:
116
  
Inhibitor
Name:
BDBM27942
Synonyms:
(2S)-1-[(2S)-2-[(2S)-2-aminopropanamido]-3-methylbutanoyl]-N-(2,2-diphenylethyl)pyrrolidine-2-carboxamide | Ala-Val-Pro-2,2-diphenethylamine, 1
Type:
Emp. Form.:
C27H36N4O3
Mol. Mass.:
464.5997
SMILES:
CC(C)[C@H](NC(=O)[C@H](C)N)C(=O)N1CCC[C@H]1C(=O)NCC(c1ccccc1)c1ccccc1
:
Substrate
Name:
BDBM17342
Synonyms:
5-carboxyflourescein(5-FAM)-conjugated AVPFFAKK | AVP-diPhe-FAM
Type:
Fluorescent dye-conjugated peptide
Emp. Form.:
Mol. Mass.:
SMILES:
: