Target
Hepatocyte growth factor receptor
Ligand
BDBM28028
Substrate
poly(Glu/Tyr)
Meas. Tech.
Met Kinase Inhibition Assay
pH
7.5±n/a
Temperature
303.15±n/a K
IC50
1±0.2 nM
Citation
 Schroeder, GMAn, YCai, ZWChen, XTClark, CCornelius, LADai, JGullo-Brown, JGupta, AHenley, BHunt, JTJeyaseelan, RKamath, AKim, KLippy, JLombardo, LJManne, VOppenheimer, SSack, JSSchmidt, RJShen, GStefanski, KTokarski, JSTrainor, GLWautlet, BSWei, DWilliams, DKZhang, YZhang, YFargnoli, JBorzilleri, RM Discovery of N-(4-(2-Amino-3-chloropyridin-4-yloxy)-3-fluorophenyl)-4-ethoxy-1-(4-fluorophenyl)-2-oxo-1,2-dihydropyridine-3-carboxamide (BMS-777607), a Selective and Orally Efficacious Inhibitor of the Met Kinase Superfamily. J Med Chem 52:1251-4 (2009)  
Target
Name:
Hepatocyte growth factor receptor
Synonyms:
Hepatocyte growth factor receptor Hepatocyte growth factor receptor (c-MET) MET Met proto-oncogene (hepatocyte growth factor receptor) Tyrosine-protein kinase Met (c-Met) c-Met kinase
Type:
Protein
Mol. Mass.:
155559.73
Organism:
Homo sapiens (Human)
Description:
P08581
Residue:
1390
  
Inhibitor
Name:
BDBM28028
Synonyms:
2-aminopyridine analogue, 7 | N-{4-[(2-amino-3-ethynylpyridin-4-yl)oxy]-3-fluorophenyl}-1-(4-fluorophenyl)-2-oxo-1,2-dihydropyridine-3-carboxamide
Type:
Small organic molecule
Emp. Form.:
C25H16F2N4O3
Mol. Mass.:
458.4163
SMILES:
Nc1nccc(Oc2ccc(NC(=O)c3cccn(-c4ccc(F)cc4)c3=O)cc2F)c1C#C
:
Substrate
Name:
poly(Glu/Tyr)
Synonyms:
Type:
Random copolymer
Mol. Mass.:
358.43
Organism:
Description:
Residue:
3
NA