Target
Hepatocyte growth factor receptor
Ligand
BDBM28029
Substrate
poly(Glu/Tyr)
Meas. Tech.
Met Kinase Inhibition Assay
pH
7.5±n/a
Temperature
303.15±n/a K
IC50
3.4±1.5 nM
Citation
 Schroeder, GMAn, YCai, ZWChen, XTClark, CCornelius, LADai, JGullo-Brown, JGupta, AHenley, BHunt, JTJeyaseelan, RKamath, AKim, KLippy, JLombardo, LJManne, VOppenheimer, SSack, JSSchmidt, RJShen, GStefanski, KTokarski, JSTrainor, GLWautlet, BSWei, DWilliams, DKZhang, YZhang, YFargnoli, JBorzilleri, RM Discovery of N-(4-(2-Amino-3-chloropyridin-4-yloxy)-3-fluorophenyl)-4-ethoxy-1-(4-fluorophenyl)-2-oxo-1,2-dihydropyridine-3-carboxamide (BMS-777607), a Selective and Orally Efficacious Inhibitor of the Met Kinase Superfamily. J Med Chem 52:1251-4 (2009)  
Target
Name:
Hepatocyte growth factor receptor
Synonyms:
Hepatocyte growth factor receptor Hepatocyte growth factor receptor (c-MET) MET Met proto-oncogene (hepatocyte growth factor receptor) Tyrosine-protein kinase Met (c-Met) c-Met kinase
Type:
Protein
Mol. Mass.:
155559.73
Organism:
Homo sapiens (Human)
Description:
P08581
Residue:
1390
  
Inhibitor
Name:
BDBM28029
Synonyms:
2-aminopyridine analogue, 8 | N-(4-{[2-amino-3-(propan-2-yl)pyridin-4-yl]oxy}-3-fluorophenyl)-1-(4-fluorophenyl)-2-oxo-1,2-dihydropyridine-3-carboxamide
Type:
Small organic molecule
Emp. Form.:
C26H22F2N4O3
Mol. Mass.:
476.4747
SMILES:
CC(C)c1c(N)nccc1Oc1ccc(NC(=O)c2cccn(-c3ccc(F)cc3)c2=O)cc1F
:
Substrate
Name:
poly(Glu/Tyr)
Synonyms:
Type:
Random copolymer
Mol. Mass.:
358.43
Organism:
Description:
Residue:
3
NA