Target
Mast/stem cell growth factor receptor Kit [D816V]
Ligand
BDBM392364
Substrate
Meas. Tech.
Exemplary c-Kit Biochemical Assay
Ki
<1000±n/a nM
Citation
 Wu, GChan, KEwing, TIbrahim, PNLin, JNespi, MSpevak, WZhang, Y Compounds and methods for kinase modulation, and indications therefor US Patent  US10301280 Publication Date 5/28/2019 
Target
Name:
Mast/stem cell growth factor receptor Kit [D816V]
Synonyms:
KIT Mast/stem cell growth factor receptor Kit (D816V) SCFR | Tyrosine-protein kinase Kit (Kit)(D816V)
Type:
Protein
Mol. Mass.:
109854.42
Organism:
Homo sapiens (Human)
Description:
Human Kit D816V mutant
Residue:
976
  
Inhibitor
Name:
BDBM392364
Synonyms:
3-cyclopropyl-N-(2-phenyl-1H- pyrrolo[2,3-b]pyridin-5-yl)-1H- pyrazole-5-carboxamide | US10301280, Compound P-2009
Type:
Small organic molecule
Emp. Form.:
C20H17N5O
Mol. Mass.:
343.3819
SMILES:
O=C(Nc1cnc2[nH]c(cc2c1)-c1ccccc1)c1cc(n[nH]1)C1CC1
: