Target
Mast/stem cell growth factor receptor Kit
Ligand
BDBM392493
Substrate
Meas. Tech.
Exemplary c-Kit Mutant Biochemical Assay
Ki
<1000±n/a nM
Citation
 Wu, GChan, KEwing, TIbrahim, PNLin, JNespi, MSpevak, WZhang, Y Compounds and methods for kinase modulation, and indications therefor US Patent  US10301280 Publication Date 5/28/2019 
Target
Name:
Mast/stem cell growth factor receptor Kit
Synonyms:
CD117 antigen KIT Mast/stem cell growth factor receptor Kit (cKIT) Proto-oncogene tyrosine-protein kinase Kit Stem cell growth factor receptor Tyrosine-protein kinase Kit c-kit v-kit Hardy-Zuckerman 4 feline sarcoma viral oncogene homolog
Type:
Protein
Mol. Mass.:
109869.37
Organism:
Homo sapiens (Human)
Description:
P10721
Residue:
976
  
Inhibitor
Name:
BDBM392493
Synonyms:
N-[2-(4-chloro-2-methyl-phenyl)- 1H-pyrrolo[2,3-b]pyridin-5-yl]- 3,4-dimethyl-1H-pyrazole-5- carboxamide | US10301280, Compound P-2277
Type:
Small organic molecule
Emp. Form.:
C20H18ClN5O
Mol. Mass.:
379.843
SMILES:
Cc1n[nH]c(C(=O)Nc2cnc3[nH]c(cc3c2)-c2ccc(Cl)cc2C)c1C
: