Target
Plasma kallikrein
Ligand
BDBM392534
Substrate
Meas. Tech.
In Vitro Enzyme Inhibition
IC50
<100±n/a nM
Citation
 McDonald, AQian, S Therapeutic inhibitory compounds US Patent  US10301284 Publication Date 5/28/2019 
Target
Name:
Plasma kallikrein
Synonyms:
Fletcher factor KLKB1 Kallikrein Plasma kallikrein heavy chain Plasma prekallikrein
Type:
Protein
Mol. Mass.:
71391.16
Organism:
Homo sapiens (Human)
Description:
P03952
Residue:
638
  
Inhibitor
Name:
BDBM392534
Synonyms:
5-amino-N-((6-amino-2,4- dimethylpyridin-3-yl)methyl)-1-((3- chloroquinolin-6-yl)methyl)-1H-1,2,4- triazole-3-carboxamide US10781200, Example 20
Type:
Small organic molecule
Emp. Form.:
C21H21ClN8O
Mol. Mass.:
436.897
SMILES:
Cc1cc(N)nc(C)c1CNC(=O)c1nc(N)n(Cc2ccc3ncc(Cl)cc3c2)n1
: