Target
Plasma kallikrein
Ligand
BDBM392546
Substrate
Meas. Tech.
In Vitro Enzyme Inhibition
IC50
<100±n/a nM
Citation
 McDonald, AQian, S Therapeutic inhibitory compounds US Patent  US10301284 Publication Date 5/28/2019 
Target
Name:
Plasma kallikrein
Synonyms:
Fletcher factor KLKB1 Kallikrein Plasma kallikrein heavy chain Plasma prekallikrein
Type:
Protein
Mol. Mass.:
71391.16
Organism:
Homo sapiens (Human)
Description:
P03952
Residue:
638
  
Inhibitor
Name:
BDBM392546
Synonyms:
N-((6-amino-2,4-dimethylpyridin-3- yl)methyl)-7-((3-chloroquinolin-6- yl)methyl)-7H-pyrrolo[2,3- d]pyrimidine-5-carboxamide US10781200, Example 32
Type:
Small organic molecule
Emp. Form.:
C25H22ClN7O
Mol. Mass.:
471.941
SMILES:
Cc1cc(N)nc(C)c1CNC(=O)c1cn(Cc2ccc3ncc(Cl)cc3c2)c2ncncc12
: