Target
Plasma kallikrein
Ligand
BDBM392568
Substrate
Meas. Tech.
In Vitro Enzyme Inhibition
IC50
<100±n/a nM
Citation
 McDonald, AQian, S Therapeutic inhibitory compounds US Patent  US10301284 Publication Date 5/28/2019 
Target
Name:
Plasma kallikrein
Synonyms:
Fletcher factor KLKB1 Kallikrein Plasma kallikrein heavy chain Plasma prekallikrein
Type:
Protein
Mol. Mass.:
71391.16
Organism:
Homo sapiens (Human)
Description:
P03952
Residue:
638
  
Inhibitor
Name:
BDBM392568
Synonyms:
N-((1-aminoisoquinolin-6-yl)methyl)- 1-((3-chloro-8-fluoroquinolin-6- yl)methyl)-3-cyano-1H-pyrazole-4- carboxamide US10781200, Example 54
Type:
Small organic molecule
Emp. Form.:
C25H17ClFN7O
Mol. Mass.:
485.9
SMILES:
Nc1nccc2cc(CNC(=O)c3cn(Cc4cc(F)c5ncc(Cl)cc5c4)nc3C#N)ccc12
: