Target
Plasma kallikrein
Ligand
BDBM392570
Substrate
Meas. Tech.
In Vitro Enzyme Inhibition
IC50
<100±n/a nM
Citation
 McDonald, AQian, S Therapeutic inhibitory compounds US Patent  US10301284 Publication Date 5/28/2019 
Target
Name:
Plasma kallikrein
Synonyms:
Fletcher factor KLKB1 Kallikrein Plasma kallikrein heavy chain Plasma prekallikrein
Type:
Protein
Mol. Mass.:
71391.16
Organism:
Homo sapiens (Human)
Description:
P03952
Residue:
638
  
Inhibitor
Name:
BDBM392570
Synonyms:
N-((3-chloro-1H-pyrrolo[2,3- b]pyridin-5-yl)methyl)-1-((3-chloro-8- fluoroquinolin-6-yl)methyl)-3-cyano- 1H-pyrazole-4-carboxamide US10781200, Example 56
Type:
Small organic molecule
Emp. Form.:
C23H14Cl2FN7O
Mol. Mass.:
494.308
SMILES:
Fc1cc(Cn2cc(C(=O)NCc3cnc4[nH]cc(Cl)c4c3)c(n2)C#N)cc2cc(Cl)cnc12
: