Target
Plasma kallikrein
Ligand
BDBM392572
Substrate
Meas. Tech.
In Vitro Enzyme Inhibition
IC50
<100±n/a nM
Citation
 McDonald, AQian, S Therapeutic inhibitory compounds US Patent  US10301284 Publication Date 5/28/2019 
Target
Name:
Plasma kallikrein
Synonyms:
Fletcher factor KLKB1 Kallikrein Plasma kallikrein heavy chain Plasma prekallikrein
Type:
Protein
Mol. Mass.:
71391.16
Organism:
Homo sapiens (Human)
Description:
P03952
Residue:
638
  
Inhibitor
Name:
BDBM392572
Synonyms:
N-((6-amino-2,4-dimethylpyridin-3- yl)methyl)-1-((3-chloro-8-(2- hydroxypropan-2-yl)quinolin-6- yl)methyl)-3-cyano-1H-pyrazole-4- carboxamide US10781200, Example 58
Type:
Small organic molecule
Emp. Form.:
C26H26ClN7O2
Mol. Mass.:
503.983
SMILES:
Cc1cc(N)nc(C)c1CNC(=O)c1cn(Cc2cc(c3ncc(Cl)cc3c2)C(C)(C)O)nc1C#N
: