Target
Plasma kallikrein
Ligand
BDBM392576
Substrate
Meas. Tech.
In Vitro Enzyme Inhibition
IC50
<100±n/a nM
Citation
 McDonald, AQian, S Therapeutic inhibitory compounds US Patent  US10301284 Publication Date 5/28/2019 
Target
Name:
Plasma kallikrein
Synonyms:
Fletcher factor KLKB1 Kallikrein Plasma kallikrein heavy chain Plasma prekallikrein
Type:
Protein
Mol. Mass.:
71391.16
Organism:
Homo sapiens (Human)
Description:
P03952
Residue:
638
  
Inhibitor
Name:
BDBM392576
Synonyms:
N-((6-amino-2,4-dimethylpyridin-3- yl)methyl)-3-cyano-1-((8-cyano-3- methylquinolin-6-yl)methyl)-1H- pyrazole-4-carboxamide US10781200, Example 62
Type:
Small organic molecule
Emp. Form.:
C25H22N8O
Mol. Mass.:
450.4952
SMILES:
Cc1cnc2c(cc(Cn3cc(C(=O)NCc4c(C)cc(N)nc4C)c(n3)C#N)cc2c1)C#N
: