Target
Plasma kallikrein
Ligand
BDBM392579
Substrate
Meas. Tech.
In Vitro Enzyme Inhibition
IC50
<100±n/a nM
Citation
 McDonald, AQian, S Therapeutic inhibitory compounds US Patent  US10301284 Publication Date 5/28/2019 
Target
Name:
Plasma kallikrein
Synonyms:
Fletcher factor KLKB1 Kallikrein Plasma kallikrein heavy chain Plasma prekallikrein
Type:
Protein
Mol. Mass.:
71391.16
Organism:
Homo sapiens (Human)
Description:
P03952
Residue:
638
  
Inhibitor
Name:
BDBM392579
Synonyms:
N-((6-amino-2-methylpyridin-3- yl)methyl)-3-cyano-1-((3- cyclopropylquinolin-6-yl)methyl)-1H- pyrazole-4-carboxamide US10781200, Example 66
Type:
Small organic molecule
Emp. Form.:
C25H23N7O
Mol. Mass.:
437.4964
SMILES:
Cc1nc(N)ccc1CNC(=O)c1cn(Cc2ccc3ncc(cc3c2)C2CC2)nc1C#N
: