Target
Plasma kallikrein
Ligand
BDBM392581
Substrate
Meas. Tech.
In Vitro Enzyme Inhibition
IC50
<100±n/a nM
Citation
 McDonald, AQian, S Therapeutic inhibitory compounds US Patent  US10301284 Publication Date 5/28/2019 
Target
Name:
Plasma kallikrein
Synonyms:
Fletcher factor KLKB1 Kallikrein Plasma kallikrein heavy chain Plasma prekallikrein
Type:
Protein
Mol. Mass.:
71391.16
Organism:
Homo sapiens (Human)
Description:
P03952
Residue:
638
  
Inhibitor
Name:
BDBM392581
Synonyms:
N-((6-amino-2,4-dimethylpyridin-3- yl)methyl)-1-((3-chloro-8- (methylsulfonyl)quinolin-6- yl)methyl)-3-cyano-1H-pyrazole-4- carboxamide US10781200, Example 68
Type:
Small organic molecule
Emp. Form.:
C24H22ClN7O3S
Mol. Mass.:
523.995
SMILES:
Cc1cc(N)nc(C)c1CNC(=O)c1cn(Cc2cc(c3ncc(Cl)cc3c2)S(C)(=O)=O)nc1C#N
: