Target
Melanocortin receptor 4
Ligand
BDBM392661
Substrate
Meas. Tech.
Test for Evaluating Human MC Receptor Activation, Using Cells Expressing Human MC4, MC1, or MC3 Receptor
EC50
11.0±n/a nM
Citation
 Sugane, TMakino, TYamashita, DYonetoku, YTanabe, DMihara, HAsai, NOsoda, KShimizu, TMoritomo, HSugasawa, KMaeno, KHosogai, N Piperazine derivative US Patent  US10301286 Publication Date 5/28/2019 
Target
Name:
Melanocortin receptor 4
Synonyms:
MC4-R MC4R_HUMAN Melanocortin receptor 4 (MC-4) Melanocortin receptor 4 (MC4R)
Type:
Enzyme
Mol. Mass.:
36949.50
Organism:
Homo sapiens (Human)
Description:
P32245
Residue:
332
  
Inhibitor
Name:
BDBM392661
Synonyms:
US10301286, Example 87
Type:
Small organic molecule
Emp. Form.:
C31H38ClF2N3O4
Mol. Mass.:
590.101
SMILES:
C[C@H]1CN(CCN1C(=O)[C@@H]1CN(C[C@H]1c1ccc(Cl)cc1F)C1CCOCC1)[C@@H](Cc1ccc(C)cc1F)C(O)=O
: