Target
Melanocyte-stimulating hormone receptor
Ligand
BDBM392670
Substrate
Meas. Tech.
Test for Evaluating Human MC Receptor Activation, Using Cells Expressing Human MC4, MC1, or MC3 Receptor
EC50
15000±n/a nM
Citation
 Sugane, TMakino, TYamashita, DYonetoku, YTanabe, DMihara, HAsai, NOsoda, KShimizu, TMoritomo, HSugasawa, KMaeno, KHosogai, N Piperazine derivative US Patent  US10301286 Publication Date 5/28/2019 
Target
Name:
Melanocyte-stimulating hormone receptor
Synonyms:
MC1-R MSH-R MSHR_HUMAN Melanocortin receptor (M1 and M4) Melanocortin receptor 1 (MC1-R) | Melanocortin receptor 1 (MC1R)
Type:
Enzyme
Mol. Mass.:
34717.23
Organism:
Homo sapiens (Human)
Description:
Q01726
Residue:
317
  
Inhibitor
Name:
BDBM392670
Synonyms:
US10301286, Example 24
Type:
Small organic molecule
Emp. Form.:
C37H42F2N6O4
Mol. Mass.:
672.764
SMILES:
CN(C)CC[C@H]1CN(CCN1C(=O)[C@@H]1CN(C[C@H]1c1ccc(F)cc1F)c1ccc(=O)n(C)n1)[C@@H](Cc1ccc2ccccc2c1)C(O)=O
: