Target
Melanocortin receptor 4
Ligand
BDBM392676
Substrate
Meas. Tech.
Test for Evaluating Human MC Receptor Activation, Using Cells Expressing Human MC4, MC1, or MC3 Receptor
EC50
1100±n/a nM
Citation
 Sugane, TMakino, TYamashita, DYonetoku, YTanabe, DMihara, HAsai, NOsoda, KShimizu, TMoritomo, HSugasawa, KMaeno, KHosogai, N Piperazine derivative US Patent  US10301286 Publication Date 5/28/2019 
Target
Name:
Melanocortin receptor 4
Synonyms:
MC4-R MC4R_HUMAN Melanocortin receptor 4 (MC-4) Melanocortin receptor 4 (MC4R)
Type:
Enzyme
Mol. Mass.:
36949.50
Organism:
Homo sapiens (Human)
Description:
P32245
Residue:
332
  
Inhibitor
Name:
BDBM392676
Synonyms:
US10301286, Example 45
Type:
Small organic molecule
Emp. Form.:
C33H45N3O4
Mol. Mass.:
547.7281
SMILES:
COc1ccc(cc1)C1CN(CC1C(=O)N1CCN(C[C@@H]1C)[C@@H](Cc1ccc2CCCc2c1)C(O)=O)C(C)(C)C
: