Target
Melanocortin receptor 3
Ligand
BDBM392677
Substrate
Meas. Tech.
Test for Evaluating Human MC Receptor Activation, Using Cells Expressing Human MC4, MC1, or MC3 Receptor
EC50
11000±n/a nM
Citation
 Sugane, TMakino, TYamashita, DYonetoku, YTanabe, DMihara, HAsai, NOsoda, KShimizu, TMoritomo, HSugasawa, KMaeno, KHosogai, N Piperazine derivative US Patent  US10301286 Publication Date 5/28/2019 
Target
Name:
Melanocortin receptor 3
Synonyms:
MC3-R MC3R_HUMAN Melanocortin receptor (M3 and M4)
Type:
Enzyme
Mol. Mass.:
36044.86
Organism:
Homo sapiens (Human)
Description:
P41968
Residue:
323
  
Inhibitor
Name:
BDBM392677
Synonyms:
US10301286, Example 47
Type:
Small organic molecule
Emp. Form.:
C33H41FN4O3
Mol. Mass.:
560.702
SMILES:
C[C@H]1CN(CCN1C(=O)C1CN(CC1c1ccc(cc1F)C#N)C(C)(C)C)[C@@H](Cc1ccc2CCCc2c1)C(O)=O
: