Target
Melanocortin receptor 4
Ligand
BDBM392678
Substrate
Meas. Tech.
Test for Evaluating Human MC Receptor Activation, Using Cells Expressing Human MC4, MC1, or MC3 Receptor
EC50
64.0±n/a nM
Citation
 Sugane, TMakino, TYamashita, DYonetoku, YTanabe, DMihara, HAsai, NOsoda, KShimizu, TMoritomo, HSugasawa, KMaeno, KHosogai, N Piperazine derivative US Patent  US10301286 Publication Date 5/28/2019 
Target
Name:
Melanocortin receptor 4
Synonyms:
MC4-R MC4R_HUMAN Melanocortin receptor 4 (MC-4) Melanocortin receptor 4 (MC4R)
Type:
Enzyme
Mol. Mass.:
36949.50
Organism:
Homo sapiens (Human)
Description:
P32245
Residue:
332
  
Inhibitor
Name:
BDBM392678
Synonyms:
US10301286, Example 50
Type:
Small organic molecule
Emp. Form.:
C32H35F2N3O4
Mol. Mass.:
563.6348
SMILES:
CC[C@H]1CN(CCN1C(=O)[C@@H]1CN(C[C@H]1c1ccc(F)cc1F)C(C)=O)[C@@H](Cc1ccc2ccccc2c1)C(O)=O
: