Target
Tyrosine-protein kinase BTK
Ligand
BDBM389663
Substrate
Meas. Tech.
IC50 Determination of BTK Inhibitors in ADP-Glo Kinase Biochemical Assay
IC50
<500±n/a nM
Citation
 Chen, XGao, YLiu, CNi, HMulvihill, M Substituted nicotinimide inhibitors of BTK and their preparation and use in the treatment of cancer, inflammation and autoimmune disease US Patent  US10301297 Publication Date 5/28/2019 
Target
Name:
Tyrosine-protein kinase BTK
Synonyms:
AGMX1 Agammaglobulinaemia tyrosine kinase B cell progenitor kinase BPK BTK_HUMAN Tyrosine Kinase BTK Tyrosine-protein kinase BTK (BTK)
Type:
Enzyme
Mol. Mass.:
76289.95
Organism:
Homo sapiens (Human)
Description:
Q06187
Residue:
659
  
Inhibitor
Name:
BDBM389663
Synonyms:
2-(1-acryloylpyrrolidin-3-yl)-4-(4-phenoxyphenyl)thiazole-5-carboxamide US11840513, Example 41 | US9951056, Example 41
Type:
Small organic molecule
Emp. Form.:
C23H21N3O3S
Mol. Mass.:
419.496
SMILES:
NC(=O)c1sc(nc1-c1ccc(Oc2ccccc2)cc1)C1CCN(C1)C(=O)C=C
: