Target
Mitogen-activated protein kinase 1
Ligand
BDBM318047
Substrate
Meas. Tech.
Inhibition Assays of ERK
IC50
<50±n/a nM
Citation
 Li, LWu, TFeng, JRen, PLiu, Y Inhibitors of ERK and methods of use US Patent  US10301317 Publication Date 5/28/2019 
Target
Name:
Mitogen-activated protein kinase 1
Synonyms:
ERK2 Extracellular signal-regulated kinase 2 Extracellular signal-regulated kinase 2 (ERK2) MAPK 2 MK01_HUMAN Mitogen-activated protein kinase 1 (ERK-2) Mitogen-activated protein kinase 2 PRKM2 | p42-MAPK
Type:
Ser/Thr Protein Kinase
Mol. Mass.:
41392.76
Organism:
Homo sapiens (Human)
Description:
P28482
Residue:
360
  
Inhibitor
Name:
BDBM318047
Synonyms:
US10301317, Example 3 | US9624228, Example 3
Type:
Small organic molecule
Emp. Form.:
C21H16ClN5O
Mol. Mass.:
389.838
SMILES:
Clc1cccc(CN2Cc3cc4c(n[nH]c4cc3NC2=O)-c2ccncc2)c1
: