Target
Mitogen-activated protein kinase 1
Ligand
BDBM318143
Substrate
Meas. Tech.
Inhibition Assays of ERK
IC50
<50±n/a nM
Citation
 Li, LWu, TFeng, JRen, PLiu, Y Inhibitors of ERK and methods of use US Patent  US10301317 Publication Date 5/28/2019 
Target
Name:
Mitogen-activated protein kinase 1
Synonyms:
ERK2 Extracellular signal-regulated kinase 2 Extracellular signal-regulated kinase 2 (ERK2) MAPK 2 MK01_HUMAN Mitogen-activated protein kinase 1 (ERK-2) Mitogen-activated protein kinase 2 PRKM2 | p42-MAPK
Type:
Ser/Thr Protein Kinase
Mol. Mass.:
41392.76
Organism:
Homo sapiens (Human)
Description:
P28482
Residue:
360
  
Inhibitor
Name:
BDBM318143
Synonyms:
US10301317, Example 99 | US9624228, Example 99
Type:
Small organic molecule
Emp. Form.:
C21H16F2N6O2
Mol. Mass.:
422.3875
SMILES:
COc1ncc(cn1)-c1n[nH]c2cc3NC(=O)N(Cc4ccc(F)cc4F)Cc3cc12
: