Target
Mitogen-activated protein kinase 1
Ligand
BDBM318170
Substrate
Meas. Tech.
Inhibition Assays of ERK
IC50
<50±n/a nM
Citation
 Li, LWu, TFeng, JRen, PLiu, Y Inhibitors of ERK and methods of use US Patent  US10301317 Publication Date 5/28/2019 
Target
Name:
Mitogen-activated protein kinase 1
Synonyms:
ERK2 Extracellular signal-regulated kinase 2 Extracellular signal-regulated kinase 2 (ERK2) MAPK 2 MK01_HUMAN Mitogen-activated protein kinase 1 (ERK-2) Mitogen-activated protein kinase 2 PRKM2 | p42-MAPK
Type:
Ser/Thr Protein Kinase
Mol. Mass.:
41392.76
Organism:
Homo sapiens (Human)
Description:
P28482
Residue:
360
  
Inhibitor
Name:
BDBM318170
Synonyms:
US10301317, Example 126 | US9624228, Example 126
Type:
Small organic molecule
Emp. Form.:
C26H26FN7O2
Mol. Mass.:
487.5287
SMILES:
COc1cccc(F)c1CN1CCC[C@H](C1)N1Cc2cc3c(n[nH]c3cc2NC1=O)-c1ccnnc1
: