Target
Glutamate receptor ionotropic, NMDA 2A
Ligand
BDBM393042
Substrate
Meas. Tech.
Biological Assay
IC50
4590±n/a nM
Citation
 Anderson, DRVolkmann, RA N-arylmethyl sulfonamide negative modulators of NR2A US Patent  US9963434 Publication Date 5/8/2018 
Target
Name:
Glutamate receptor ionotropic, NMDA 2A
Synonyms:
GRIN2A Glutamate [NMDA] receptor Glutamate [NMDA] receptor subunit epsilon-1 NMDA receptor subtype 2A protein (NR2A) NMDE1_HUMAN hNR2A
Type:
Mol. Mass.:
165293.76
Organism:
Homo sapiens (Human)
Description:
Residue:
1464
  
Inhibitor
Name:
BDBM393042
Synonyms:
5-(3-chloro-4- fluorobenzenesulfon- amidomethyl)-N-[(1- methyl-1H-pyrazol-4- yl)methyl]pyridine-2- carboxamide | US9963434, Table 12.3
Type:
Small organic molecule
Emp. Form.:
C18H17ClFN5O3S
Mol. Mass.:
437.876
SMILES:
Cn1cc(CNC(=O)c2ccc(CNS(=O)(=O)c3ccc(F)c(Cl)c3)cn2)cn1
: