Target
Glutamate receptor ionotropic, NMDA 2A
Ligand
BDBM393083
Substrate
Meas. Tech.
Biological Assay
IC50
1950±n/a nM
Citation
 Anderson, DRVolkmann, RA N-arylmethyl sulfonamide negative modulators of NR2A US Patent  US9963434 Publication Date 5/8/2018 
Target
Name:
Glutamate receptor ionotropic, NMDA 2A
Synonyms:
GRIN2A Glutamate [NMDA] receptor Glutamate [NMDA] receptor subunit epsilon-1 NMDA receptor subtype 2A protein (NR2A) NMDE1_HUMAN hNR2A
Type:
Mol. Mass.:
165293.76
Organism:
Homo sapiens (Human)
Description:
Residue:
1464
  
Inhibitor
Name:
BDBM393083
Synonyms:
5-(3-chloro-4- fluorobenzenesulfon- amidomethyl)-N-(1,3- oxazol-5- ylmethyl)pyridine-2- carboxamide | US9963434, Table 12.28
Type:
Small organic molecule
Emp. Form.:
C17H14ClFN4O4S
Mol. Mass.:
424.834
SMILES:
Fc1ccc(cc1Cl)S(=O)(=O)NCc1ccc(nc1)C(=O)NCc1cnco1
: