Target
Glutamate receptor ionotropic, NMDA 2A
Ligand
BDBM393096
Substrate
Meas. Tech.
Biological Assay
IC50
630±n/a nM
Citation
 Anderson, DRVolkmann, RA N-arylmethyl sulfonamide negative modulators of NR2A US Patent  US9963434 Publication Date 5/8/2018 
Target
Name:
Glutamate receptor ionotropic, NMDA 2A
Synonyms:
GRIN2A Glutamate [NMDA] receptor Glutamate [NMDA] receptor subunit epsilon-1 NMDA receptor subtype 2A protein (NR2A) NMDE1_HUMAN hNR2A
Type:
Mol. Mass.:
165293.76
Organism:
Homo sapiens (Human)
Description:
Residue:
1464
  
Inhibitor
Name:
BDBM393096
Synonyms:
6-(3-chloro-4- fluorobenzenesulfon- amidomethyl)-N-[(5- methylpyrazin-2- yl)methyl]pyridine-3- carboxamide | US9963434, Table 12.41
Type:
Small organic molecule
Emp. Form.:
C19H17ClFN5O3S
Mol. Mass.:
449.886
SMILES:
Cc1cnc(CNC(=O)c2ccc(CNS(=O)(=O)c3ccc(F)c(Cl)c3)nc2)cn1
: