Target
Glutamate receptor ionotropic, NMDA 2A
Ligand
BDBM393233
Substrate
Meas. Tech.
Biological Assay
IC50
4020±n/a nM
Citation
 Anderson, DRVolkmann, RA N-arylmethyl sulfonamide negative modulators of NR2A US Patent  US9963434 Publication Date 5/8/2018 
Target
Name:
Glutamate receptor ionotropic, NMDA 2A
Synonyms:
GRIN2A Glutamate [NMDA] receptor Glutamate [NMDA] receptor subunit epsilon-1 NMDA receptor subtype 2A protein (NR2A) NMDE1_HUMAN hNR2A
Type:
Mol. Mass.:
165293.76
Organism:
Homo sapiens (Human)
Description:
Residue:
1464
  
Inhibitor
Name:
BDBM393233
Synonyms:
N-[(2-methyl-1,3- thiazol-5-yl)methyl]-5- (thiophene-2- sulfonamidomethyl) pyridine-2-carboxamide | US9963434, Table 12.176
Type:
Small organic molecule
Emp. Form.:
C16H16N4O3S3
Mol. Mass.:
408.518
SMILES:
Cc1ncc(CNC(=O)c2ccc(CNS(=O)(=O)c3cccs3)cn2)s1
: