Target
Carbonic anhydrase 2
Ligand
BDBM320972
Substrate
Meas. Tech.
Enzyme Activity Inhibition
IC50
>1000±n/a nM
Citation
 Mizutani, TYoshimura, CKondo, HKitade, MOhkubo, S Pyrrolopyrimidine compound or salt thereof and compositions containing the pyrrolopyrimidine compound or salt thereof US Patent  US9963456 Publication Date 5/8/2018 
Target
Name:
Carbonic anhydrase 2
Synonyms:
CA-II CAC Carbonate dehydratase II Carbonic anhydrase 2 (CA-II) Carbonic anhydrase C Carbonic anhydrase II (CA-II) Carbonic anhydrase II (hCA II) | Carbonic anhydrase isoenzyme II (hCA II)
Type:
Enzyme
Mol. Mass.:
29250.71
Organism:
Homo sapiens (Human)
Description:
P00918
Residue:
260
  
Inhibitor
Name:
BDBM320972
Synonyms:
4-Amino-5-[2-[2,6-difluoro-4-[(3R)-3-fluoropyrrolidin-1-yl]phenyl]ethynyl]-7-[(2R,3R,4S,5R)-3,4-dihydroxy-5-[(sulfamoylamino)methyl]tetrahydrofuran-2-yl]pyrrolo[2,3-d]pyrimidine US9963456, Example 29
Type:
Small organic molecule
Emp. Form.:
C23H24F3N7O5S
Mol. Mass.:
567.541
SMILES:
Nc1ncnc2n(cc(C#Cc3c(F)cc(cc3F)N3CC[C@@H](F)C3)c12)[C@@H]1O[C@H](CNS(N)(=O)=O)[C@@H](O)[C@H]1O
: