Target
Carbonic anhydrase 2
Ligand
BDBM320997
Substrate
Meas. Tech.
Enzyme Activity Inhibition
IC50
790±n/a nM
Citation
 Mizutani, TYoshimura, CKondo, HKitade, MOhkubo, S Pyrrolopyrimidine compound or salt thereof and compositions containing the pyrrolopyrimidine compound or salt thereof US Patent  US9963456 Publication Date 5/8/2018 
Target
Name:
Carbonic anhydrase 2
Synonyms:
CA-II CAC Carbonate dehydratase II Carbonic anhydrase 2 (CA-II) Carbonic anhydrase C Carbonic anhydrase II (CA-II) Carbonic anhydrase II (hCA II) | Carbonic anhydrase isoenzyme II (hCA II)
Type:
Enzyme
Mol. Mass.:
29250.71
Organism:
Homo sapiens (Human)
Description:
P00918
Residue:
260
  
Inhibitor
Name:
BDBM320997
Synonyms:
4-Amino-7-[(2R,3R,4S,5R)-3,4-dihydroxy-5-[(sulfamoylamino)methyl]tetrahydrofuran-2-yl]-5-[2-[2-fluoro-6-(2,2,2-trifluoroethoxy)phenyl]ethynyl]pyrrolo[2,3-d]pyrimidine US9963456, Example 61
Type:
Small organic molecule
Emp. Form.:
C21H20F4N6O6S
Mol. Mass.:
560.479
SMILES:
Nc1ncnc2n(cc(C#Cc3c(F)cccc3OCC(F)(F)F)c12)[C@@H]1O[C@H](CNS(N)(=O)=O)[C@@H](O)[C@H]1O
: