Target
Carbonic anhydrase 2
Ligand
BDBM321001
Substrate
Meas. Tech.
Enzyme Activity Inhibition
IC50
>1000±n/a nM
Citation
 Mizutani, TYoshimura, CKondo, HKitade, MOhkubo, S Pyrrolopyrimidine compound or salt thereof and compositions containing the pyrrolopyrimidine compound or salt thereof US Patent  US9963456 Publication Date 5/8/2018 
Target
Name:
Carbonic anhydrase 2
Synonyms:
CA-II CAC Carbonate dehydratase II Carbonic anhydrase 2 (CA-II) Carbonic anhydrase C Carbonic anhydrase II (CA-II) Carbonic anhydrase II (hCA II) | Carbonic anhydrase isoenzyme II (hCA II)
Type:
Enzyme
Mol. Mass.:
29250.71
Organism:
Homo sapiens (Human)
Description:
P00918
Residue:
260
  
Inhibitor
Name:
BDBM321001
Synonyms:
4-Amino-7-[(2R,3R,4S,5R)-3,4-dihydroxy-5-[(sulfamoylamino)methyl]tetrahydrofuran-2-yl]-5-[2-(2-ethylsulfanyl-6-fluoro-phenyl)ethynyl]pyrrolo[2,3-d]pyrimidine US9963456, Example 66
Type:
Small organic molecule
Emp. Form.:
C21H23FN6O5S2
Mol. Mass.:
522.573
SMILES:
CCSc1cccc(F)c1C#Cc1cn([C@@H]2O[C@H](CNS(N)(=O)=O)[C@@H](O)[C@H]2O)c2ncnc(N)c12
: