Target
Carbonic anhydrase 2
Ligand
BDBM321042
Substrate
Meas. Tech.
Enzyme Activity Inhibition
IC50
>1000±n/a nM
Citation
 Mizutani, TYoshimura, CKondo, HKitade, MOhkubo, S Pyrrolopyrimidine compound or salt thereof and compositions containing the pyrrolopyrimidine compound or salt thereof US Patent  US9963456 Publication Date 5/8/2018 
Target
Name:
Carbonic anhydrase 2
Synonyms:
CA-II CAC Carbonate dehydratase II Carbonic anhydrase 2 (CA-II) Carbonic anhydrase C Carbonic anhydrase II (CA-II) Carbonic anhydrase II (hCA II) | Carbonic anhydrase isoenzyme II (hCA II)
Type:
Enzyme
Mol. Mass.:
29250.71
Organism:
Homo sapiens (Human)
Description:
P00918
Residue:
260
  
Inhibitor
Name:
BDBM321042
Synonyms:
8-[2-[4-amino-7-[(1R,2S,3R,4R)-2,3-dihydroxy-4-[(sulfamoylamino)methyl]cyclopentyl]pyrrolo[2,3-d]pyrimidin-5-yl]ethynyl]-7-fluoro-4-methyl-2,3-dihydro-1,4-benzoxazine US9963456, Example 122
Type:
Small organic molecule
Emp. Form.:
C23H26FN7O5S
Mol. Mass.:
531.56
SMILES:
CN1CCOc2c1ccc(F)c2C#Cc1cn([C@@H]2C[C@H](CNS(N)(=O)=O)[C@@H](O)[C@H]2O)c2ncnc(N)c12
: