Target
Carbonic anhydrase 2
Ligand
BDBM321065
Substrate
Meas. Tech.
Enzyme Activity Inhibition
IC50
260±n/a nM
Citation
 Mizutani, TYoshimura, CKondo, HKitade, MOhkubo, S Pyrrolopyrimidine compound or salt thereof and compositions containing the pyrrolopyrimidine compound or salt thereof US Patent  US9963456 Publication Date 5/8/2018 
Target
Name:
Carbonic anhydrase 2
Synonyms:
CA-II CAC Carbonate dehydratase II Carbonic anhydrase 2 (CA-II) Carbonic anhydrase C Carbonic anhydrase II (CA-II) Carbonic anhydrase II (hCA II) | Carbonic anhydrase isoenzyme II (hCA II)
Type:
Enzyme
Mol. Mass.:
29250.71
Organism:
Homo sapiens (Human)
Description:
P00918
Residue:
260
  
Inhibitor
Name:
BDBM321065
Synonyms:
4-[4-Amino-7-[(2R,4S,5R)-4-hydroxy-5-[(sulfamoylamino)methyl]tetrahydrofuran-2-yl]pyrrolo[2,3-d]pyrimidin-5-yl]-2-(o-tolyl)thiazole US9963456, Example 126
Type:
Small organic molecule
Emp. Form.:
C21H23N7O4S2
Mol. Mass.:
501.582
SMILES:
Cc1ccccc1-c1nc(cs1)-c1cn([C@H]2C[C@H](O)[C@@H](CNS(N)(=O)=O)O2)c2ncnc(N)c12
: