Target
Inhibitor of nuclear factor kappa-B kinase subunit alpha
Ligand
BDBM29424
Substrate
I-kappa-B-alpha
Meas. Tech.
IKK Kinase Inhibition Assay
pH
7.4±n/a
Temperature
295.15±n/a K
IC50
10000±n/a nM
Citation
 Christopher, JABamborough, PAlder, CCampbell, ACutler, GJDown, KHamadi, AMJolly, AMKerns, JKLucas, FSMellor, GWMiller, DDMorse, MAPancholi, KDRumsey, WSolanke, YEWilliamson, R Discovery of 6-aryl-7-alkoxyisoquinoline inhibitors of IkappaB kinase-beta (IKK-beta). J Med Chem 52:3098-102 (2009)  
Target
Name:
Inhibitor of nuclear factor kappa-B kinase subunit alpha
Synonyms:
CHUK I-kappa-B kinase 1 IKK-A IKK1 IKKA IkBKA Inhibitor of NF-kappa-B kinase alpha/beta Nuclear factor NF-kappa-B inhibitor kinase alpha TCF16 | Transcription factor 16
Type:
PROTEIN
Mol. Mass.:
84642.21
Organism:
Homo sapiens (Human)
Description:
ChEMBL_327453
Residue:
745
  
Inhibitor
Name:
BDBM29424
Synonyms:
7-alkoxyisoquinoline, 34
Type:
Small organic molecule
Emp. Form.:
C21H22N2O
Mol. Mass.:
318.4122
SMILES:
C(Oc1cc2cnccc2cc1-c1ccccc1)C1CCNCC1
:
Substrate
Name:
NF-kappa-B inhibitor alpha
Synonyms:
I-kappa-B-alpha IKBA_HUMAN NF-kappa-B inhibitor alpha NFKBIA
Type:
GST fusion protein
Mol. Mass.:
35584.84
Organism:
Homo sapiens (Human)
Description:
It was produced in E. coli as GST-tagged fusion protein (Santa Cruz Biotechnology).
Residue:
317