Target
Inhibitor of nuclear factor kappa-B kinase subunit beta
Ligand
BDBM29424
Substrate
I-kappa-B-alpha
Meas. Tech.
IKK Kinase Inhibition Assay
IC50
1259±n/a nM
Citation
 Christopher, JABamborough, PAlder, CCampbell, ACutler, GJDown, KHamadi, AMJolly, AMKerns, JKLucas, FSMellor, GWMiller, DDMorse, MAPancholi, KDRumsey, WSolanke, YEWilliamson, R Discovery of 6-aryl-7-alkoxyisoquinoline inhibitors of IkappaB kinase-beta (IKK-beta). J Med Chem 52:3098-102 (2009)  
Target
Name:
Inhibitor of nuclear factor kappa-B kinase subunit beta
Synonyms:
I-kappa-B Kinase 2 (IKK-beta) I-kappa-B-kinase beta IKBKB IKK-beta IKK2/IKK1 IKKB_HUMAN Inhibitor of nuclear factor kappa B kinase beta subunit Nuclear factor NF-kappa-B inhibitor kinase beta
Type:
Serine/threonine-protein kinase
Mol. Mass.:
86554.39
Organism:
Homo sapiens (Human)
Description:
GST-tagged IKK-2 was expressed in High Five cells and purified.
Residue:
756
  
Inhibitor
Name:
BDBM29424
Synonyms:
7-alkoxyisoquinoline, 34
Type:
Small organic molecule
Emp. Form.:
C21H22N2O
Mol. Mass.:
318.4122
SMILES:
C(Oc1cc2cnccc2cc1-c1ccccc1)C1CCNCC1
:
Substrate
Name:
NF-kappa-B inhibitor alpha
Synonyms:
I-kappa-B-alpha IKBA_HUMAN NF-kappa-B inhibitor alpha NFKBIA
Type:
GST fusion protein
Mol. Mass.:
35584.84
Organism:
Homo sapiens (Human)
Description:
It was produced in E. coli as GST-tagged fusion protein (Santa Cruz Biotechnology).
Residue:
317