Target
5-hydroxytryptamine receptor 1A
Ligand
BDBM29559
Substrate
BDBM21393
Meas. Tech.
Radioligand Binding Assay (Ki)
pH
7.4±n/a
Temperature
310.15±n/a K
Ki
9±1 nM
Comments
Data was taken from literature.
Citation
 Paluchowska, MHBugno, RDuszyńska, BTatarczyńska, ENikiforuk, ALenda, TChojnacka-Wójcik, E The influence of modifications in imide fragment structure on 5-HT(1A) and 5-HT(7) receptor affinity and in vivo pharmacological properties of some new 1-(m-trifluoromethylphenyl)piperazines. Bioorg Med Chem 15:7116-25 (2007)  
Target
Name:
5-hydroxytryptamine receptor 1A
Synonyms:
5-HT-1A 5-HT1A 5-hydroxytryptamine receptor 1A (5HT1A) 5ht1a Htr1a Serotonin 1a (5-HT1a) receptor/Adrenergic receptor alpha-1 | Serotonin receptor 1A
Type:
G Protein-Coupled Receptor (GPCR)
Mol. Mass.:
46445.29
Organism:
Rattus norvegicus (rat)
Description:
Binding assays were performed using rat hippocampal membranes.
Residue:
422
  
Inhibitor
Name:
BDBM29559
Synonyms:
1-(m-trifluorophenyl)piperazine, 6
Type:
Small organic molecule
Emp. Form.:
C24H32F3N3O2
Mol. Mass.:
451.525
SMILES:
CC1(C)CC(=O)N(C2CCC(CC2)N2CCN(CC2)c2cccc(c2)C(F)(F)F)C(=O)C1
:
Substrate
Name:
BDBM21393
Synonyms:
7-(dipropylamino)-5,6,7,8-tetrahydronaphthalen-1-ol 8-OH-DPAT 8-OH-DPAT,(-) CHEMBL1788118 CHEMBL56 US10562853, Compound 8-OH-DPAT cid_1220
Type:
radiolabeled ligand
Emp. Form.:
C16H25NO
Mol. Mass.:
247.3758
SMILES:
CCCN(CCC)C1CCc2cccc(O)c2C1
: