Target
5-hydroxytryptamine receptor 1A
Ligand
BDBM29562
Substrate
BDBM21393
Meas. Tech.
Radioligand Binding Assay (Ki)
pH
7.4±n/a
Temperature
310.15±n/a K
Ki
5.9±0.5 nM
Citation
 Paluchowska, MHBugno, RDuszyńska, BTatarczyńska, ENikiforuk, ALenda, TChojnacka-Wójcik, E The influence of modifications in imide fragment structure on 5-HT(1A) and 5-HT(7) receptor affinity and in vivo pharmacological properties of some new 1-(m-trifluoromethylphenyl)piperazines. Bioorg Med Chem 15:7116-25 (2007)  
Target
Name:
5-hydroxytryptamine receptor 1A
Synonyms:
5-HT-1A 5-HT1A 5-hydroxytryptamine receptor 1A (5HT1A) 5ht1a Htr1a Serotonin 1a (5-HT1a) receptor/Adrenergic receptor alpha-1 | Serotonin receptor 1A
Type:
G Protein-Coupled Receptor (GPCR)
Mol. Mass.:
46445.29
Organism:
Rattus norvegicus (rat)
Description:
Binding assays were performed using rat hippocampal membranes.
Residue:
422
  
Inhibitor
Name:
BDBM29562
Synonyms:
1-(m-trifluorophenyl)piperazine, 9
Type:
Small organic molecule
Emp. Form.:
C23H28F3N3O2
Mol. Mass.:
435.4825
SMILES:
FC(F)(F)c1cccc(c1)N1CCN(CCCCN2C(=O)C3=C(CCCC3)C2=O)CC1
:
Substrate
Name:
BDBM21393
Synonyms:
7-(dipropylamino)-5,6,7,8-tetrahydronaphthalen-1-ol 8-OH-DPAT 8-OH-DPAT,(-) CHEMBL1788118 CHEMBL56 US10562853, Compound 8-OH-DPAT cid_1220
Type:
radiolabeled ligand
Emp. Form.:
C16H25NO
Mol. Mass.:
247.3758
SMILES:
CCCN(CCC)C1CCc2cccc(O)c2C1
: