Target
Alpha-1B adrenergic receptor
Ligand
BDBM29566
Substrate
BDBM29568
Meas. Tech.
Radioligand Binding Assay (Ki)
Ki
48±n/a nM
Citation
 Paluchowska, MHBugno, RDuszyńska, BTatarczyńska, ENikiforuk, ALenda, TChojnacka-Wójcik, E The influence of modifications in imide fragment structure on 5-HT(1A) and 5-HT(7) receptor affinity and in vivo pharmacological properties of some new 1-(m-trifluoromethylphenyl)piperazines. Bioorg Med Chem 15:7116-25 (2007)  
Target
Name:
Alpha-1B adrenergic receptor
Synonyms:
ADA1B_RAT Alpha 1B-adrenoceptor Alpha adrenergic receptor 1A and 1B Alpha-1Adrenoceptor Alpha-1B adrenoreceptor | adrenergic Alpha1B
Type:
G Protein-Coupled Receptor (GPCR)
Mol. Mass.:
56606.71
Organism:
Rattus norvegicus (rat)
Description:
Receptor binding assays were performed using rat cortical membranes.
Residue:
515
  
Inhibitor
Name:
BDBM29566
Synonyms:
1-(m-trifluorophenyl)piperazine, 13
Type:
Small organic molecule
Emp. Form.:
C21H26F3N3O2
Mol. Mass.:
409.4452
SMILES:
CC1=C(C)C(=O)N(CCCCN2CCN(CC2)c2cccc(c2)C(F)(F)F)C1=O
:
Substrate
Name:
BDBM29568
Synonyms:
CHEMBL2 PRAZOSIN HYDROCHLORIDE [3H]-Minipress [3H]-Prazosin
Type:
radiolabeled ligand
Emp. Form.:
C19H21N5O4
Mol. Mass.:
383.4011
SMILES:
COc1cc2nc(nc(N)c2cc1OC)N1CCN(CC1)C(=O)c1ccco1
: