Target
Tyrosine-protein kinase JAK1
Ligand
BDBM394368
Substrate
Meas. Tech.
JAK Enzyme Assays
Ki
0.580±n/a nM
Citation
 Zak, MRomero, FACheng, Y Therapeutic compounds and compositions, and methods of use thereof US Patent  US10307426 Publication Date 6/4/2019 
Target
Name:
Tyrosine-protein kinase JAK1
Synonyms:
JAK-1 JAK1A JAK1_HUMAN Janus kinase 1 (JAK1) | Janus kinase 1 JAK1
Type:
Protein
Mol. Mass.:
133293.73
Organism:
Homo sapiens (Human)
Description:
P23458
Residue:
1154
  
Inhibitor
Name:
BDBM394368
Synonyms:
N-[3-[5-chloro-2- (difluoromethoxy)phenyl]-1-[2- (dimethylamino)-1-methyl-2-oxo- ethyl]pyrazol-4-yl]pyrazolo[1,5- a]pyrimidine-3-carboxamide US10307426, Example 11
Type:
Small organic molecule
Emp. Form.:
C22H20ClF2N7O3
Mol. Mass.:
503.889
SMILES:
CC(C(=O)N(C)C)n1cc(NC(=O)c2cnn3cccnc23)c(n1)-c1cc(Cl)ccc1OC(F)F
: