Target
Runt-related transcription factor 1
Ligand
BDBM29657
Substrate
Venus-CBFbeta-SMMHC
Meas. Tech.
Identification of compounds inhibiting the binding between the RUNX1 Runt domain and CBFbeta-SMMHC via a time resolved fluorescence resonance energy transfer (TR-FRET) assay.
pH
7.4±n/a
Temperature
296.15±n/a K
IC50
100000±n/a nM
Citation
 PubChem, PC Identification of compounds inhibiting the binding between the RUNX1 Runt domain and CBFb-SMMHC via a time resolved fluorescence resonance energy transfer (TR-FRET) assay. PubChem Bioassay (2009)[AID] 
Target
Name:
Runt-related transcription factor 1
Synonyms:
AML1 CBF-alpha-2 Core-binding factor subunit alpha-2 Polyomavirus enhancer-binding protein 2 alpha B subunit RUNX1_HUMAN | Runt-Related Transcription Factor 1 Isoform AML1C
Type:
Subunit of heterodimeric transcription factor
Mol. Mass.:
48750.25
Organism:
Homo sapiens (Human)
Description:
Q01196
Residue:
453
  
Inhibitor
Name:
BDBM29657
Synonyms:
2-[(Z)-Benzoylimino]-1-furan-2-ylmethyl-8-methyl-10-oxo-1,10-dihydro-2H-1,9,10a-triaza-anthracene-3- carboxylic acid ethyl ester 2-benzoylimino-1-(2-furfuryl)-5-keto-10-methyl-dipyrido[3,4-c:1',2'-f]pyrimidine-3-carboxylic acid ethyl ester SMR000148560 ethyl 1-(furan-2-ylmethyl)-10-methyl-5-oxidanylidene-2-(phenylcarbonylimino)dipyrido[3,4-c:1',2'-f]pyrimidine-3-carboxylate | ethyl 2-benzoylimino-1-(furan-2-ylmethyl)-10-methyl-5-oxodipyrido[3,4-c:1',2'-f]pyrimidine-3-carboxylate
Type:
Small organic molecule
Emp. Form.:
C27H22N4O5
Mol. Mass.:
482.4874
SMILES:
CCOC(=O)c1cc2c(nc3c(C)cccn3c2=O)n(Cc2ccco2)\c1=N\C(=O)c1ccccc1
:
Substrate
Name:
Core-binding factor subunit beta isoform 2
Synonyms:
CBFB PEBB_HUMAN Venus-core-binding factor subunit beta-smooth muscle myosin heavy chain
Type:
Fluorescent fusion protein
Mol. Mass.:
21988.19
Organism:
Homo sapiens (Human)
Description:
Q13951-2
Residue:
187