Target
Serine/threonine-protein kinase B-raf [V600E]
Ligand
BDBM29713
Substrate
Dual specificity mitogen-activated protein kinase kinase 1
Meas. Tech.
B-RAF (V600E) Kinase Inhibition Assay
pH
7.2±n/a
Temperature
295.15±n/a K
IC50
600±n/a nM
Citation
 Niculescu-Duvaz, DGaulon, CDijkstra, HPNiculescu-Duvaz, IZambon, AMénard, DSuijkerbuijk, BMNourry, ADavies, LManne, HFriedlos, FOgilvie, LHedley, DWhittaker, SKirk, RGill, ATaylor, RDRaynaud, FIMoreno-Farre, JMarais, RSpringer, CJ Pyridoimidazolones as novel potent inhibitors of v-Raf murine sarcoma viral oncogene homologue B1 (BRAF). J Med Chem 52:2255-64 (2009)  
Target
Name:
Serine/threonine-protein kinase B-raf [V600E]
Synonyms:
B-RAF V600E B-Raf Protein Kinase Mutant (V600E) BRAF BRAF mutant V600E BRAF_HUMAN Protein mono-ADP-ribosyltransferase (PARP3) RAFB1 Serine/threonine-protein kinase B-raf (V600E) V-RAF murine sarcoma viral oncogene homologue B1 mutant (BRAF V600E)
Type:
Mol. Mass.:
84474.98
Organism:
Homo sapiens (Human)
Description:
P15056 V600E
Residue:
766
  
Inhibitor
Name:
BDBM29713
Synonyms:
Pyridoimidazolone, 5m
Type:
Small organic molecule
Emp. Form.:
C23H21FN6O4
Mol. Mass.:
464.449
SMILES:
Fc1cc(NC(=O)Nc2ccc(Oc3ccnc4[nH]c(=O)[nH]c34)cc2)cc(c1)N1CCOCC1
:
Substrate
Name:
Dual specificity mitogen-activated protein kinase kinase 1
Synonyms:
GST fusion of MAP kinase kinase 1 MAP2K1 MP2K1_RABIT glutathione S-transferase-MAP kinase kinase 1
Type:
Other Protein Type
Mol. Mass.:
43453
Organism:
Oryctolagus cuniculus (rabbit)
Description:
Rabbit MEK1 was purchased from Millipore.
Residue:
393