Target
Beta-secretase 2
Ligand
BDBM29803
Substrate
Fluorescent Substrate
Meas. Tech.
Enzyme Inhibition Assay
IC50
1140±n/a nM
Citation
 Charrier, NClarke, BCutler, LDemont, EDingwall, CDunsdon, RHawkins, JHowes, CHubbard, JHussain, IMaile, GMatico, RMosley, JNaylor, AO'Brien, ARedshaw, SRowland, PSoleil, VSmith, KJSweitzer, STheobald, PVesey, DWalter, DSWayne, G Second generation of BACE-1 inhibitors part 3: Towards non hydroxyethylamine transition state mimetics. Bioorg Med Chem Lett 19:3674-8 (2009)  
Target
Name:
Beta-secretase 2
Synonyms:
AEPLC ASP1 Asp 1 Aspartyl protease 1 BACE2_HUMAN Beta-secretase (BACE) Beta-secretase 2 (BACE-2) Beta-site APP-cleaving enzyme 2 Memapsin-1 beta-Secretase (BACE-2)
Type:
Protein
Mol. Mass.:
56171.20
Organism:
Homo sapiens (Human)
Description:
Q9Y5Z0
Residue:
518
  
Inhibitor
Name:
BDBM29803
Synonyms:
sulfonamide tricyclic analogue, 14
Type:
Small organic molecule
Emp. Form.:
C26H34N4O4S
Mol. Mass.:
498.638
SMILES:
CCNC[C@@H](O)[C@H](Cc1ccccc1)NC(=O)c1cc2N(C)S(=O)(=O)CCn3cc(CC)c(c1)c23
:
Substrate
Name:
Fluorescent Substrate
Synonyms:
Type:
Peptide
Mol. Mass.:
2030.30
Organism:
Description:
Residue:
18
FAMSEVNLDAEFKTAMRA