Target
Diacylglycerol O-acyltransferase 1
Ligand
BDBM395371
Substrate
Meas. Tech.
Measurement of DGAT1 Inhibitory Activity
IC50
76.0±n/a nM
Citation
 Saruta, KHayashi, NSakurai, OSawamoto, HOoboki, E Aromatic heterocyclic compound US Patent  US10308636 Publication Date 6/4/2019 
Target
Name:
Diacylglycerol O-acyltransferase 1
Synonyms:
ACAT-related gene product 1 Acyl coA-diacylglycerol acyl transferase 1 (DGAT1) DGAT1 Diacylglycerol Acyltransferase (DGAT1) Diacylglycerol O-acyltransferase 1 (DGAT1) | Diglyceride acyltransferase
Type:
Protein
Mol. Mass.:
55297.82
Organism:
Homo sapiens (Human)
Description:
O75907
Residue:
488
  
Inhibitor
Name:
BDBM395371
Synonyms:
US10308636, Example 57
Type:
Small organic molecule
Emp. Form.:
C23H23F3N4O4
Mol. Mass.:
476.4483
SMILES:
COC[C@@]1(CC[C@@H](CC1)Oc1ccc(cn1)-c1ccc(cc1)-c1nnc([nH]1)C(F)(F)F)C(O)=O
: