Target
Tyrosine-protein phosphatase non-receptor type 11
Ligand
BDBM395989
Substrate
Meas. Tech.
SHP2 Allosteric Inhibition Assay
IC50
20.0±n/a nM
Citation
 Chen, ZFortanet, JGLaMarche, MJSendzik, MTamez, Jr., VYu, B Compounds and compositions for inhibiting the activity of SHP2 US Patent  US10308660 Publication Date 6/4/2019 
Target
Name:
Tyrosine-protein phosphatase non-receptor type 11
Synonyms:
3.1.3.48 PTP-1D PTP2C Protein Tyrosine Phosphatase PPN11/Shp2 Protein-Tyrosine Phosphatase SHP-2 Protein-tyrosine phosphatase 2C SH-PTP3 SHP2 Src homology phosphatase 2 (SHP-2) Tyrosine-protein phosphatase non-receptor type 11 (SHP-2) | Tyrosine-protein phosphatase non-receptor type 11 (SHP2)
Type:
Protein phosphatase
Mol. Mass.:
68443.59
Organism:
Homo sapiens (Human)
Description:
Q06124
Residue:
593
  
Inhibitor
Name:
BDBM395989
Synonyms:
US10308660, Example 66
Type:
Small organic molecule
Emp. Form.:
C20H27ClN6OS
Mol. Mass.:
434.986
SMILES:
C[C@H]1C[C@@H](N)C2(C1)CCN(CC2)c1nc(N)c(Sc2cccnc2Cl)c(=O)n1C
: